{"text_format":"1","workbook":"xlsx","n_sheets":8,"sheets":["共通科目","専門科目","土木GPT","目標ごとの達成度","総括表","GPT","GPA","グラフ用データ"],"not_rendered":{"charts":4,"images":0,"macros":1,"external_links":0,"defined_names":10,"comments":0,"pivot_tables":0},"unopened":[{"sheet":"GPT","index":5,"reason":"not_a_worksheet"},{"sheet":"GPA","index":6,"reason":"not_a_worksheet"}],"bounds":{"document_bytes":16777216,"sheet_cells":100000,"rows_first":2000,"rows_last":500,"rows_between":2000,"halvings":0,"cell_chars":16384,"cell_head_chars":4096},"cells_cut":0,"cells_raw":0,"read":"whole","date_system":"1900"}

{"sheet":"共通科目","index":0,"n_rows":81,"n_cols":45,"rows_kept":81,"cut":false,"hidden":false,"merged":[[52,12,58,12],[2,7,2,14],[3,11,3,12],[3,13,3,14],[60,10,64,10],[61,11,67,11],[51,11,58,11],[6,7,30,7],[6,8,30,8],[6,9,30,9],[6,10,30,10],[76,1,79,2],[51,2,58,2],[59,2,67,2],[5,1,33,1],[50,1,67,1],[34,1,49,2],[22,2,33,2],[14,2,21,2],[6,2,13,2],[68,1,75,2],[1,3,1,16],[0,3,0,16],[3,7,3,8],[3,9,3,10],[2,1,4,2],[2,3,4,4],[2,16,4,16],[2,5,3,6],[2,15,4,15]]}
[null,null,null,"共通科目チェックシート"]
[null,null,null,"黄色背景の成績欄をドロップダウンリストによって入力すること\nバグや不具合があれば，森河（morikawa.yukihiro@nitech.ac.jp）まで．"]
[null,"区分",null,"授業科目名\n（○：土木GPT対応科目）",null,"単位数",null,"毎週授業時間数",null,null,null,null,null,null,null,"単位取得\n年度・学期","成績"]
[null,null,null,null,null,null,null,"1年次",null,"2年次",null,"3年次",null,"4年次"]
[null,null,null,null,null,"必修","選択","前期","後期","前期","後期","前期","後期","前期","後期",null,null,null,"必修単位","選択単位","GP","土木GP","学期",1,2,3,4,5,6,7,8,9,10,11,1,2,3,4,5,6,7,8,9,10,11]
[null,"人間社会",null,null,"フレッシュマンセミナー",1,null,2,null,null,null,null,null,null,null,null,null,null,{"$f":"IF($Q6=\"\",0,IF(INDEX(目標ごとの達成度!$O$94:$O$102,MATCH($Q6,目標ごとの達成度!$N$94:$N$102,0),1)>0,1,0))*F6","v":0},{"$f":"IF($Q6=\"\",0,IF(INDEX(目標ごとの達成度!$O$94:$O$102,MATCH($Q6,目標ごとの達成度!$N$94:$N$102,0),1)>0,1,0))*G6","v":0},{"$f":"IF($Q6=\"\",0,INDEX(目標ごとの達成度!$O$94:$O$102,MATCH($Q6,目標ごとの達成度!$N$94:$N$102,0),1))*(F6+G6)","v":0},{"$f":"IF(OR(D6=\"○\",D6=\"◎\"),U6,0)","v":0},{"$f":"IF(P6=\"\",99,INDEX(目標ごとの達成度!$M$108:$M$118,MATCH(P6,目標ごとの達成度!$N$108:$N$118,0),1))","v":99},{"$f":"IF($W6=X$5,$S6+$T6,0)","v":0},{"$f":"IF($W6=Y$5,$S6+$T6,0)","v":0},0,0,0,0,0,0,0,0,0,{"$f":"IF($W6=AI$5,$V6,0)","v":0},{"$f":"IF($W6=AJ$5,$V6,0)","v":0},0,0,0,0,0,0,0,0,0]
[null,null,"技術と人間・心理","○","異文化理解",null,2,4,2,2,2,null,null,null,null,null,null,null,{"$f":"IF($Q7=\"\",0,IF(INDEX(目標ごとの達成度!$O$94:$O$102,MATCH($Q7,目標ごとの達成度!$N$94:$N$102,0),1)>0,1,0))*F7","v":0},{"$f":"IF($Q7=\"\",0,IF(INDEX(目標ごとの達成度!$O$94:$O$102,MATCH($Q7,目標ごとの達成度!$N$94:$N$102,0),1)>0,1,0))*G7","v":0},{"$f":"IF($Q7=\"\",0,INDEX(目標ごとの達成度!$O$94:$O$102,MATCH($Q7,目標ごとの達成度!$N$94:$N$102,0),1))*(F7+G7)","v":0},{"$f":"IF(OR(D7=\"○\",D7=\"◎\"),U7,0)","v":0},{"$f":"IF(P7=\"\",99,INDEX(目標ごとの達成度!$M$108:$M$118,MATCH(P7,目標ごとの達成度!$N$108:$N$118,0),1))","v":99},{"$f":"IF($W7=X$5,$S7+$T7,0)","v":0},0,0,0,0,0,0,0,0,0,0,{"$f":"IF($W7=AI$5,$V7,0)","v":0},0,0,0,0,0,0,0,0,0,0]
[null,null,null,"○","感性と社会",null,2,null,null,null,null,null,null,null,null,null,null,null,{"$f":"IF($Q8=\"\",0,IF(INDEX(目標ごとの達成度!$O$94:$O$102,MATCH($Q8,目標ごとの達成度!$N$94:$N$102,0),1)>0,1,0))*F8","v":0},{"$f":"IF($Q8=\"\",0,IF(INDEX(目標ごとの達成度!$O$94:$O$102,MATCH($Q8,目標ごとの達成度!$N$94:$N$102,0),1)>0,1,0))*G8","v":0},{"$f":"IF($Q8=\"\",0,INDEX(目標ごとの達成度!$O$94:$O$102,MATCH($Q8,目標ごとの達成度!$N$94:$N$102,0),1))*(F8+G8)","v":0},0,{"$f":"IF(P8=\"\",99,INDEX(目標ごとの達成度!$M$108:$M$118,MATCH(P8,目標ごとの達成度!$N$108:$N$118,0),1))","v":99},0,0,0,0,0,0,0,0,0,0,0,0,0,0,0,0,0,0,0,0,0,0]
{"$rows_left_out":74}
{"sheet":"専門科目","index":1,"n_rows":51,"n_cols":43,"rows_kept":51,"cut":false,"hidden":false,"merged":[[2,14,4,14],[0,3,0,15],[1,3,1,15],[3,10,3,11],[24,2,35,2],[2,15,4,15],[5,2,9,2],[3,12,3,13],[36,2,47,2],[5,1,49,1],[10,2,23,2],[2,6,2,13],[2,1,4,2],[2,3,4,3],[2,4,3,5],[3,6,3,7],[3,8,3,9]]}
[null,null,null,"専門科目チェックシート"]
[null,null,null,"黄色背景の成績欄をドロップダウンリストによって入力すること\nバグや不具合があれば，森河（morikawa.yukihiro@nitech.ac.jp）まで．"]
[null,"区分",null,"授業科目名\n（すべて土木GPT対応科目）","単位数",null,"毎週授業時間数",null,null,null,null,null,null,null,"単位取得\n年度・学期","成績"]
[null,null,null,null,null,null,"1年次",null,"2年次",null,"3年次",null,"4年次"]
[null,null,null,null,"必修","選択","前期","後期","前期","後期","前期","後期","前期","後期",null,null,null,"必修単位","選択単位","GP","学期",1,2,3,4,5,6,7,8,9,10,11,1,2,3,4,5,6,7,8,9,10,11]
[null,"専門教育科目","学科共通科目","社会工学概論",2,null,2,null,null,null,null,null,null,null,null,null,null,{"$f":"IF($P6=\"\",0,IF(INDEX(目標ごとの達成度!$O$94:$O$102,MATCH($P6,目標ごとの達成度!$N$94:$N$102,0),1)>0,1,0))*E6","v":0},{"$f":"IF($P6=\"\",0,IF(INDEX(目標ごとの達成度!$O$94:$O$102,MATCH($P6,目標ごとの達成度!$N$94:$N$102,0),1)>0,1,0))*F6","v":0},{"$f":"IF($P6=\"\",0,INDEX(目標ごとの達成度!$O$94:$O$102,MATCH($P6,目標ごとの達成度!$N$94:$N$102,0),1))*(E6+F6)","v":0},{"$f":"IF(O6=\"\",99,INDEX(目標ごとの達成度!$M$108:$M$118,MATCH(O6,目標ごとの達成度!$N$108:$N$118,0),1))","v":99},{"$f":"IF($U6=V$5,$R6+$S6,0)","v":0},{"$f":"IF($U6=W$5,$R6+$S6,0)","v":0},0,0,0,0,0,0,0,0,0,{"$f":"IF($U6=AG$5,$T6,0)","v":0},{"$f":"IF($U6=AH$5,$T6,0)","v":0},0,0,0,0,0,0,0,0,0]
[null,null,null,"社会工学基礎Ⅰ",2,null,2,null,null,null,null,null,null,null,null,null,null,{"$f":"IF($P7=\"\",0,IF(INDEX(目標ごとの達成度!$O$94:$O$102,MATCH($P7,目標ごとの達成度!$N$94:$N$102,0),1)>0,1,0))*E7","v":0},{"$f":"IF($P7=\"\",0,IF(INDEX(目標ごとの達成度!$O$94:$O$102,MATCH($P7,目標ごとの達成度!$N$94:$N$102,0),1)>0,1,0))*F7","v":0},{"$f":"IF($P7=\"\",0,INDEX(目標ごとの達成度!$O$94:$O$102,MATCH($P7,目標ごとの達成度!$N$94:$N$102,0),1))*(E7+F7)","v":0},{"$f":"IF(O7=\"\",99,INDEX(目標ごとの達成度!$M$108:$M$118,MATCH(O7,目標ごとの達成度!$N$108:$N$118,0),1))","v":99},{"$f":"IF($U7=V$5,$R7+$S7,0)","v":0},0,0,0,0,0,0,0,0,0,0,{"$f":"IF($U7=AG$5,$T7,0)","v":0},0,0,0,0,0,0,0,0,0,0]
[null,null,null,"社会工学基礎Ⅱ",2,null,null,2,null,null,null,null,null,null,null,null,null,{"$f":"IF($P8=\"\",0,IF(INDEX(目標ごとの達成度!$O$94:$O$102,MATCH($P8,目標ごとの達成度!$N$94:$N$102,0),1)>0,1,0))*E8","v":0},{"$f":"IF($P8=\"\",0,IF(INDEX(目標ごとの達成度!$O$94:$O$102,MATCH($P8,目標ごとの達成度!$N$94:$N$102,0),1)>0,1,0))*F8","v":0},{"$f":"IF($P8=\"\",0,INDEX(目標ごとの達成度!$O$94:$O$102,MATCH($P8,目標ごとの達成度!$N$94:$N$102,0),1))*(E8+F8)","v":0},{"$f":"IF(O8=\"\",99,INDEX(目標ごとの達成度!$M$108:$M$118,MATCH(O8,目標ごとの達成度!$N$108:$N$118,0),1))","v":99},0,0,0,0,0,0,0,0,0,0,0,0,0,0,0,0,0,0,0,0,0,0]
{"$rows_left_out":44}
{"sheet":"土木GPT","index":2,"n_rows":28,"n_cols":10,"rows_kept":28,"cut":false,"hidden":false,"merged":[[0,1,0,9],[1,3,1,5],[1,1,2,2],[1,8,2,9],[2,3,2,4],[1,6,2,7],[8,8,8,9],[9,8,9,9],[3,1,7,1],[8,1,8,2],[3,7,7,7],[3,9,7,9],[3,4,7,4],[8,6,8,7],[9,6,9,7],[8,3,8,4],[9,3,9,4],[9,1,9,2],[27,1,27,2],[27,3,27,9],[19,1,19,9],[20,1,20,2],[21,1,25,1],[11,6,11,7],[26,1,26,2],[26,3,26,9],[20,3,20,9],[21,8,25,9],[21,3,21,7],[22,3,22,7],[23,3,23,7],[24,3,24,7],[25,3,25,7],[11,3,11,5]]}
[null,"集計結果"]
[null,"科目区分",null,"取得単位数",null,null,"GPT(参考値)",null,"GPA(参考値)"]
[null,null,null,"必修＋選択",null,"必修"]
[null,"共通科目","人間社会",{"$f":"SUM(共通科目!S6:T34)","v":0},{"$f":"SUM(D4:D8)","v":0},{"$f":"SUM(共通科目!S6:S34)","v":0},{"$f":"SUM(共通科目!U6:U34)","v":0},{"$f":"SUM(G4:G8)","v":0},{"$f":"IF(D4=0,0,G4/D4)","v":0},{"$f":"IF(E4=0,0,H4/E4)","v":0}]
[null,null,"自然科学基礎",{"$f":"SUM(共通科目!S35:T50)","v":0},null,{"$f":"SUM(共通科目!S35:S50)","v":0},{"$f":"SUM(共通科目!U35:U50)","v":0},null,{"$f":"IF(D5=0,0,G5/D5)","v":0}]
[null,null,"産業・経営リテラシー",{"$f":"SUM(共通科目!S51:T68)","v":0},null,{"$f":"SUM(共通科目!S51:S68)","v":0},{"$f":"SUM(共通科目!U51:U68)","v":0},null,0]
[null,null,"グローバルコミュニケーション",{"$f":"SUM(共通科目!S69:T76)","v":0},null,{"$f":"SUM(共通科目!S69:S76)","v":0},{"$f":"SUM(共通科目!U69:U76)","v":0},null,0]
[null,null,"健康運動科学",{"$f":"SUM(共通科目!S77:T80)","v":0},null,{"$f":"SUM(共通科目!S77:S80)","v":0},{"$f":"SUM(共通科目!U77:U80)","v":0},null,0]
{"$rows_left_out":21}
{"sheet":"目標ごとの達成度","index":3,"n_rows":118,"n_cols":37,"rows_kept":118,"cut":false,"hidden":false,"merged":[[25,1,40,1],[41,1,50,1],[25,2,25,3],[86,1,91,1],[90,2,90,3],[88,2,88,3],[89,2,89,3],[84,2,84,3],[86,2,86,3],[87,2,87,3],[78,2,78,3],[80,2,80,3],[86,10,91,10],[13,2,13,3],[41,0,65,0],[41,8,50,8],[25,8,40,8],[27,2,27,3],[60,2,60,3],[65,2,65,3],[41,10,50,10],[48,2,48,3],[25,9,40,9],[43,2,43,3],[51,10,59,10],[86,8,91,8],[71,8,85,8],[86,9,91,9],[66,2,66,3],[51,1,59,1],[72,2,72,3],[85,2,85,3],[69,2,69,3],[57,2,57,3],[71,1,85,1],[79,2,79,3],[56,2,56,3],[60,1,65,1],[70,2,70,3],[68,2,68,3],[19,2,19,3],[6,2,6,3],[7,2,7,3],[14,2,14,3],[24,2,24,3],[12,8,24,8],[91,2,91,3],[25,10,40,10],[71,2,71,3],[67,2,67,3],[71,10,85,10],[81,2,81,3],[83,2,83,3],[74,2,74,3],[64,2,64,3],[63,2,63,3],[62,2,62,3],[61,2,61,3],[73,2,73,3],[76,2,76,3],[77,2,77,3],[75,2,75,3],[71,9,85,9],[82,2,82,3],[42,2,42,3],[51,8,59,8],[52,2,52,3],[53,2,53,3],[50,2,50,3],[47,2,47,3],[54,2,54,3],[51,2,51,3],[55,2,55,3],[59,2,59,3],[12,2,12,3],[18,2,18,3],[2,2,2,3],[3,2,3,3],[8,2,8,3],[0,0,0,10],[17,2,17,3],[1,0,1,1],[2,10,11,10],[12,10,24,10],[10,2,10,3],[11,2,11,3],[16,2,16,3],[21,2,21,3],[22,2,22,3],[9,2,9,3],[2,0,40,0],[29,2,29,3],[2,1,11,1],[28,2,28,3],[30,2,40,2],[23,2,23,3],[12,1,24,1],[5,2,5,3],[66,0,91,0],[66,1,70,1],[60,8,65,8],[60,9,65,9],[60,10,65,10],[66,8,70,8],[66,9,70,9],[66,10,70,10],[1,2,1,3],[41,2,41,3],[20,2,20,3],[4,2,4,3],[15,2,15,3],[58,2,58,3],[51,9,59,9],[45,2,45,3],[46,2,46,3],[44,2,44,3],[49,2,49,3],[2,9,11,9],[12,9,24,9],[2,8,11,8],[41,9,50,9],[26,2,26,3]]}
["「学習・教育到達目標」ごとの達成度"]
["学習・教育到達目標",null,"関連する科目（◎必修）",null,"開講時期","単位数","単位取得\n年度・学期","成績","取得\n単位数","GPT","GPA",null,"点数","取得単位数","学期",1,2,3,4,5,6,7,8,9,10,11,1,2,3,4,5,6,7,8,9,10,11]
["Ⅰ　幅広い教養と技術者倫理","(A) 科学技術基礎\n(科学技術の共通基礎科目として数学・外国語・情報処理能力を習得する)","◎線形代数Ⅰ",null,"１年前期",2,{"$f":"VLOOKUP(RIGHT(C3,LEN(C3)-1),共通科目!E$6:Q$80,12,FALSE)&\"\"","v":""},{"$f":"VLOOKUP(RIGHT(C3,LEN(C3)-1),共通科目!E$6:Q$80,13,FALSE)&\"\"","v":""},{"$f":"SUM(N3:N12)","v":0},{"$f":"IF(SUM(N3:N12)=0,\"0\",SUM(M3:M12))","v":"0"},{"$f":"IF(SUM(N3:N12)=0,\"0\",SUM(M3:M12)/SUM(N3:N12))","v":"0"},null,{"$f":"IF(OR(F3=\"\",H3=\"\"),0,F3*INDEX($O$94:$O$103,MATCH(H3,$N$94:$N$103,0),1))","v":0},{"$f":"IF(OR(F3=\"\",H3=\"\"),0,F3*IF(INDEX($O$94:$O$103,MATCH(H3,$N$94:$N$103,0),1)>0,1,0))","v":0},{"$f":"IF(G3=\"\",99,INDEX($M$108:$M$118,MATCH(G3,$N$108:$N$118,0),1))","v":99},{"$f":"IF($O3=AA$2,$N3,0)","v":0},{"$f":"IF($O3=AB$2,$N3,0)","v":0},{"$f":"IF($O3=AC$2,$N3,0)","v":0},{"$f":"IF($O3=AD$2,$N3,0)","v":0},{"$f":"IF($O3=AE$2,$N3,0)","v":0},{"$f":"IF($O3=AF$2,$N3,0)","v":0},{"$f":"IF($O3=AG$2,$N3,0)","v":0},{"$f":"IF($O3=AH$2,$N3,0)","v":0},{"$f":"IF($O3=AI$2,$N3,0)","v":0},{"$f":"IF($O3=AJ$2,$N3,0)","v":0},{"$f":"IF($O3=AK$2,$N3,0)","v":0},{"$f":"IF($O3=AA$2,$M3,0)","v":0},{"$f":"IF($O3=AB$2,$M3,0)","v":0},{"$f":"IF($O3=AC$2,$M3,0)","v":0},0,0,0,0,0,0,0,0]
[null,null,"◎線形代数Ⅱ",null,"１年後期",2,{"$f":"VLOOKUP(RIGHT(C4,LEN(C4)-1),共通科目!E$6:Q$80,12,FALSE)&\"\"","v":""},{"$f":"VLOOKUP(RIGHT(C4,LEN(C4)-1),共通科目!E$6:Q$80,13,FALSE)&\"\"","v":""},null,null,null,null,0,0,99,{"$f":"IF($O4=AA$2,$N4,0)","v":0},0,0,0,0,0,0,0,0,0,0,{"$f":"IF($O4=AA$2,$M4,0)","v":0},0,0,0,0,0,0,0,0,0,0]
[null,null,"◎微分積分Ⅰ及び演習",null,"１年前期",3,{"$f":"VLOOKUP(RIGHT(C5,LEN(C5)-1),共通科目!E$6:Q$80,12,FALSE)&\"\"","v":""},{"$f":"VLOOKUP(RIGHT(C5,LEN(C5)-1),共通科目!E$6:Q$80,13,FALSE)&\"\"","v":""},null,null,null,null,0,0,99,0,0,0,0,0,0,0,0,0,0,0,0,0,0,0,0,0,0,0,0,0,0]
[null,null,"　微分積分Ⅱ及び演習",null,"１年後期",3,{"$f":"VLOOKUP(RIGHT(C6,LEN(C6)-1),共通科目!E$6:Q$80,12,FALSE)&\"\"","v":""},{"$f":"VLOOKUP(RIGHT(C6,LEN(C6)-1),共通科目!E$6:Q$80,13,FALSE)&\"\"","v":""},null,null,null,null,0,0,99,0,0,0,0,0,0,0,0,0,0,0,0,0,0,0,0,0,0,0,0,0,0]
[null,null,"◎数理情報概論",null,"１年後期",2,{"$f":"VLOOKUP(RIGHT(C7,LEN(C7)-1),共通科目!E$6:Q$80,12,FALSE)&\"\"","v":""},{"$f":"VLOOKUP(RIGHT(C7,LEN(C7)-1),共通科目!E$6:Q$80,13,FALSE)&\"\"","v":""},null,null,null,null,0,0,99,{"$f":"IF($O7=AA$2,$N7,0)","v":0},0,0,0,0,0,0,0,0,0,0,0,0,0,0,0,0,0,0,0,0,0]
[null,null,"◎社会工学基礎Ⅱ",null,"１年後期",2,{"$f":"VLOOKUP(RIGHT(C8,LEN(C8)-1),専門科目!D$6:P$50,12,FALSE)&\"\"","v":""},{"$f":"VLOOKUP(RIGHT(C8,LEN(C8)-1),専門科目!D$6:P$50,13,FALSE)&\"\"","v":""},null,null,null,null,0,0,99,0,0,0,0,0,0,0,0,0,0,0,0,0,0,0,0,0,0,0,0,0,0]
{"$rows_left_out":111}
{"sheet":"総括表","index":4,"n_rows":30,"n_cols":13,"rows_kept":30,"cut":false,"hidden":false,"merged":[[0,9,0,12],[4,4,4,5],[4,6,4,7],[4,8,4,9],[3,2,3,12],[4,10,4,11],[4,12,5,12],[4,2,4,3],[26,0,26,1],[24,0,24,1],[25,0,25,1],[1,0,1,12],[2,0,2,12],[16,0,17,0],[18,0,19,0],[22,0,23,0],[20,0,21,0],[3,0,5,1],[14,0,15,0],[6,0,7,0],[8,0,9,0],[10,0,11,0],[12,0,13,0]]}
[null,"入学年度：",{"$f":"目標ごとの達成度!O105","v":2020},"年度",null,null,null,null,null,{"$f":"NOW()","v":"2020-03-18T15:34:28.400"}]
["「学習・教育到達目標」達成状況の総括表"]
["※学期ごとに，これらの数値をＪノートの総括表に転記すること"]
["学習・教育目標",null,"各期の累計取得単位数と累計GPA"]
[null,null,"１年",null,"２年",null,"３年",null,"４年",null,null,null,"それ\n以降"]
[null,null,"前期","後期","前期","後期","前期","後期","前期","後期","前期","後期"]
["(A)科学技術基礎","単位数",{"$f":"IF(C$30>$J$1,\"\",SUM(目標ごとの達成度!$P$3:P12))","v":""},{"$f":"IF(D$30>$J$1,\"\",SUM(目標ごとの達成度!$P$3:Q12))","v":""},{"$f":"IF(E$30>$J$1,\"\",SUM(目標ごとの達成度!$P$3:R12))","v":""},{"$f":"IF(F$30>$J$1,\"\",SUM(目標ごとの達成度!$P$3:S12))","v":""},{"$f":"IF(G$30>$J$1,\"\",SUM(目標ごとの達成度!$P$3:T12))","v":""},{"$f":"IF(H$30>$J$1,\"\",SUM(目標ごとの達成度!$P$3:U12))","v":""},{"$f":"IF(I$30>$J$1,\"\",SUM(目標ごとの達成度!$P$3:V12))","v":""},{"$f":"IF(J$30>$J$1,\"\",SUM(目標ごとの達成度!$P$3:W12))","v":""},{"$f":"IF(K$30>$J$1,\"\",SUM(目標ごとの達成度!$P$3:X12))","v":""},{"$f":"IF(L$30>$J$1,\"\",SUM(目標ごとの達成度!$P$3:Y12))","v":""},{"$f":"IF(M$30>$J$1,\"\",SUM(目標ごとの達成度!$P$3:Z12))","v":""}]
[null,"GPA",{"$f":"IF(C$30>$J$1,\"\",IF(C7=0,0,SUM(目標ごとの達成度!$AA$3:AA12)/C7))","v":""},{"$f":"IF(D$30>$J$1,\"\",IF(D7=0,0,SUM(目標ごとの達成度!$AA$3:AB12)/D7))","v":""},{"$f":"IF(E$30>$J$1,\"\",IF(E7=0,0,SUM(目標ごとの達成度!$AA$3:AC12)/E7))","v":""},{"$f":"IF(F$30>$J$1,\"\",IF(F7=0,0,SUM(目標ごとの達成度!$AA$3:AD12)/F7))","v":""},{"$f":"IF(G$30>$J$1,\"\",IF(G7=0,0,SUM(目標ごとの達成度!$AA$3:AE12)/G7))","v":""},{"$f":"IF(H$30>$J$1,\"\",IF(H7=0,0,SUM(目標ごとの達成度!$AA$3:AF12)/H7))","v":""},{"$f":"IF(I$30>$J$1,\"\",IF(I7=0,0,SUM(目標ごとの達成度!$AA$3:AG12)/I7))","v":""},{"$f":"IF(J$30>$J$1,\"\",IF(J7=0,0,SUM(目標ごとの達成度!$AA$3:AH12)/J7))","v":""},{"$f":"IF(K$30>$J$1,\"\",IF(K7=0,0,SUM(目標ごとの達成度!$AA$3:AI12)/K7))","v":""},{"$f":"IF(L$30>$J$1,\"\",IF(L7=0,0,SUM(目標ごとの達成度!$AA$3:AJ12)/L7))","v":""},{"$f":"IF(M$30>$J$1,\"\",IF(M7=0,0,SUM(目標ごとの達成度!$AA$3:AK12)/M7))","v":""}]
{"$rows_left_out":23}
{"sheet":"グラフ用データ","index":7,"n_rows":21,"n_cols":37,"rows_kept":21,"cut":false,"hidden":false,"merged":[[0,26,0,36],[0,15,0,25],[0,0,1,0],[0,2,1,2],[0,1,1,1],[0,3,1,3],[0,4,0,14]]}
["学習・教育到達目標","取得\n単位数","GPT","GPA","各期の累計取得単位数",null,null,null,null,null,null,null,null,null,null,"各期のGPT",null,null,null,null,null,null,null,null,null,null,"各期の累計GPA"]
[null,null,null,null,{"$f":"目標ごとの達成度!P2","v":1},{"$f":"目標ごとの達成度!Q2","v":2},{"$f":"目標ごとの達成度!R2","v":3},{"$f":"目標ごとの達成度!S2","v":4},{"$f":"目標ごとの達成度!T2","v":5},{"$f":"目標ごとの達成度!U2","v":6},{"$f":"目標ごとの達成度!V2","v":7},{"$f":"目標ごとの達成度!W2","v":8},{"$f":"目標ごとの達成度!X2","v":9},{"$f":"目標ごとの達成度!Y2","v":10},{"$f":"目標ごとの達成度!Z2","v":11},{"$f":"E2","v":1},2,3,4,5,6,7,8,9,10,11,{"$f":"E2","v":1},2,3,4,5,6,7,8,9,10,11]
["(A) 科学技術基礎",{"$f":"SUM(目標ごとの達成度!N3:N12)","v":0},{"$f":"SUM(目標ごとの達成度!M3:M12)","v":0},{"$f":"C3/B3","v":{"$error":"#DIV/0!"}},{"$f":"SUM(目標ごとの達成度!$P3:P12)","v":0},{"$f":"SUM(目標ごとの達成度!$P3:Q12)","v":0},{"$f":"SUM(目標ごとの達成度!$P3:R12)","v":0},{"$f":"SUM(目標ごとの達成度!$P3:S12)","v":0},{"$f":"SUM(目標ごとの達成度!$P3:T12)","v":0},{"$f":"SUM(目標ごとの達成度!$P3:U12)","v":0},{"$f":"SUM(目標ごとの達成度!$P3:V12)","v":0},{"$f":"SUM(目標ごとの達成度!$P3:W12)","v":0},{"$f":"SUM(目標ごとの達成度!$P3:X12)","v":0},{"$f":"SUM(目標ごとの達成度!$P3:Y12)","v":0},{"$f":"SUM(目標ごとの達成度!$P3:Z12)","v":0},{"$f":"SUM(目標ごとの達成度!$AA3:AA12)","v":0},{"$f":"SUM(目標ごとの達成度!AB3:AB12)","v":0},{"$f":"SUM(目標ごとの達成度!AC3:AC12)","v":0},{"$f":"SUM(目標ごとの達成度!AD3:AD12)","v":0},{"$f":"SUM(目標ごとの達成度!AE3:AE12)","v":0},{"$f":"SUM(目標ごとの達成度!AF3:AF12)","v":0},{"$f":"SUM(目標ごとの達成度!AG3:AG12)","v":0},{"$f":"SUM(目標ごとの達成度!AH3:AH12)","v":0},{"$f":"SUM(目標ごとの達成度!AI3:AI12)","v":0},{"$f":"SUM(目標ごとの達成度!AJ3:AJ12)","v":0},{"$f":"SUM(目標ごとの達成度!AK3:AK12)","v":0},{"$f":"IF(E3=0,0,SUM($P3:P3)/E3)","v":0},{"$f":"IF(F3=0,0,SUM($P3:Q3)/F3)","v":0},{"$f":"IF(G3=0,0,SUM($P3:R3)/G3)","v":0},{"$f":"IF(H3=0,0,SUM($P3:S3)/H3)","v":0},{"$f":"IF(I3=0,0,SUM($P3:T3)/I3)","v":0},{"$f":"IF(J3=0,0,SUM($P3:U3)/J3)","v":0},{"$f":"IF(K3=0,0,SUM($P3:V3)/K3)","v":0},{"$f":"IF(L3=0,0,SUM($P3:W3)/L3)","v":0},{"$f":"IF(M3=0,0,SUM($P3:X3)/M3)","v":0},{"$f":"IF(N3=0,0,SUM($P3:Y3)/N3)","v":0},{"$f":"IF(O3=0,0,SUM($P3:Z3)/O3)","v":0}]
["(B) 自然科学",{"$f":"SUM(目標ごとの達成度!N13:N25)","v":0},{"$f":"SUM(目標ごとの達成度!M13:M25)","v":0},{"$error":"#DIV/0!"},{"$f":"SUM(目標ごとの達成度!$P13:P25)","v":0},{"$f":"SUM(目標ごとの達成度!$P13:Q25)","v":0},{"$f":"SUM(目標ごとの達成度!$P13:R25)","v":0},{"$f":"SUM(目標ごとの達成度!$P13:S25)","v":0},{"$f":"SUM(目標ごとの達成度!$P13:T25)","v":0},{"$f":"SUM(目標ごとの達成度!$P13:U25)","v":0},{"$f":"SUM(目標ごとの達成度!$P13:V25)","v":0},{"$f":"SUM(目標ごとの達成度!$P13:W25)","v":0},{"$f":"SUM(目標ごとの達成度!$P13:X25)","v":0},{"$f":"SUM(目標ごとの達成度!$P13:Y25)","v":0},{"$f":"SUM(目標ごとの達成度!$P13:Z25)","v":0},{"$f":"SUM(目標ごとの達成度!$AA13:AA25)","v":0},{"$f":"SUM(目標ごとの達成度!AB13:AB25)","v":0},{"$f":"SUM(目標ごとの達成度!AC13:AC25)","v":0},{"$f":"SUM(目標ごとの達成度!AD13:AD25)","v":0},{"$f":"SUM(目標ごとの達成度!AE13:AE25)","v":0},{"$f":"SUM(目標ごとの達成度!AF13:AF25)","v":0},{"$f":"SUM(目標ごとの達成度!AG13:AG25)","v":0},{"$f":"SUM(目標ごとの達成度!AH13:AH25)","v":0},{"$f":"SUM(目標ごとの達成度!AI13:AI25)","v":0},{"$f":"SUM(目標ごとの達成度!AJ13:AJ25)","v":0},{"$f":"SUM(目標ごとの達成度!AK13:AK25)","v":0},{"$f":"IF(E4=0,0,SUM($P4:P4)/E4)","v":0},{"$f":"IF(F4=0,0,SUM($P4:Q4)/F4)","v":0},{"$f":"IF(G4=0,0,SUM($P4:R4)/G4)","v":0},{"$f":"IF(H4=0,0,SUM($P4:S4)/H4)","v":0},{"$f":"IF(I4=0,0,SUM($P4:T4)/I4)","v":0},{"$f":"IF(J4=0,0,SUM($P4:U4)/J4)","v":0},{"$f":"IF(K4=0,0,SUM($P4:V4)/K4)","v":0},{"$f":"IF(L4=0,0,SUM($P4:W4)/L4)","v":0},{"$f":"IF(M4=0,0,SUM($P4:X4)/M4)","v":0},{"$f":"IF(N4=0,0,SUM($P4:Y4)/N4)","v":0},{"$f":"IF(O4=0,0,SUM($P4:Z4)/O4)","v":0}]
["(C) 多面的思考と倫理",{"$f":"SUM(目標ごとの達成度!N26:N41)","v":0},{"$f":"SUM(目標ごとの達成度!M26:M41)","v":0},{"$error":"#DIV/0!"},{"$f":"SUM(目標ごとの達成度!$P26:P41)","v":0},{"$f":"SUM(目標ごとの達成度!$P26:Q41)","v":0},{"$f":"SUM(目標ごとの達成度!$P26:R41)","v":0},{"$f":"SUM(目標ごとの達成度!$P26:S41)","v":0},{"$f":"SUM(目標ごとの達成度!$P26:T41)","v":0},{"$f":"SUM(目標ごとの達成度!$P26:U41)","v":0},{"$f":"SUM(目標ごとの達成度!$P26:V41)","v":0},{"$f":"SUM(目標ごとの達成度!$P26:W41)","v":0},{"$f":"SUM(目標ごとの達成度!$P26:X41)","v":0},{"$f":"SUM(目標ごとの達成度!$P26:Y41)","v":0},{"$f":"SUM(目標ごとの達成度!$P26:Z41)","v":0},{"$f":"SUM(目標ごとの達成度!$AA26:AA41)","v":0},{"$f":"SUM(目標ごとの達成度!AB26:AB41)","v":0},{"$f":"SUM(目標ごとの達成度!AC26:AC41)","v":0},{"$f":"SUM(目標ごとの達成度!AD26:AD41)","v":0},{"$f":"SUM(目標ごとの達成度!AE26:AE41)","v":0},{"$f":"SUM(目標ごとの達成度!AF26:AF41)","v":0},{"$f":"SUM(目標ごとの達成度!AG26:AG41)","v":0},{"$f":"SUM(目標ごとの達成度!AH26:AH41)","v":0},{"$f":"SUM(目標ごとの達成度!AI26:AI41)","v":0},{"$f":"SUM(目標ごとの達成度!AJ26:AJ41)","v":0},{"$f":"SUM(目標ごとの達成度!AK26:AK41)","v":0},{"$f":"IF(E5=0,0,SUM($P5:P5)/E5)","v":0},{"$f":"IF(F5=0,0,SUM($P5:Q5)/F5)","v":0},{"$f":"IF(G5=0,0,SUM($P5:R5)/G5)","v":0},{"$f":"IF(H5=0,0,SUM($P5:S5)/H5)","v":0},{"$f":"IF(I5=0,0,SUM($P5:T5)/I5)","v":0},{"$f":"IF(J5=0,0,SUM($P5:U5)/J5)","v":0},{"$f":"IF(K5=0,0,SUM($P5:V5)/K5)","v":0},{"$f":"IF(L5=0,0,SUM($P5:W5)/L5)","v":0},{"$f":"IF(M5=0,0,SUM($P5:X5)/M5)","v":0},{"$f":"IF(N5=0,0,SUM($P5:Y5)/N5)","v":0},{"$f":"IF(O5=0,0,SUM($P5:Z5)/O5)","v":0}]
["(D) 専門基礎",{"$f":"SUM(目標ごとの達成度!N42:N51)","v":0},{"$f":"SUM(目標ごとの達成度!M42:M51)","v":0},{"$error":"#DIV/0!"},{"$f":"SUM(目標ごとの達成度!$P42:P51)","v":0},{"$f":"SUM(目標ごとの達成度!$P42:Q51)","v":0},{"$f":"SUM(目標ごとの達成度!$P42:R51)","v":0},{"$f":"SUM(目標ごとの達成度!$P42:S51)","v":0},{"$f":"SUM(目標ごとの達成度!$P42:T51)","v":0},{"$f":"SUM(目標ごとの達成度!$P42:U51)","v":0},{"$f":"SUM(目標ごとの達成度!$P42:V51)","v":0},{"$f":"SUM(目標ごとの達成度!$P42:W51)","v":0},{"$f":"SUM(目標ごとの達成度!$P42:X51)","v":0},{"$f":"SUM(目標ごとの達成度!$P42:Y51)","v":0},{"$f":"SUM(目標ごとの達成度!$P42:Z51)","v":0},{"$f":"SUM(目標ごとの達成度!$AA42:AA51)","v":0},{"$f":"SUM(目標ごとの達成度!AB42:AB51)","v":0},{"$f":"SUM(目標ごとの達成度!AC42:AC51)","v":0},{"$f":"SUM(目標ごとの達成度!AD42:AD51)","v":0},{"$f":"SUM(目標ごとの達成度!AE42:AE51)","v":0},{"$f":"SUM(目標ごとの達成度!AF42:AF51)","v":0},{"$f":"SUM(目標ごとの達成度!AG42:AG51)","v":0},{"$f":"SUM(目標ごとの達成度!AH42:AH51)","v":0},{"$f":"SUM(目標ごとの達成度!AI42:AI51)","v":0},{"$f":"SUM(目標ごとの達成度!AJ42:AJ51)","v":0},{"$f":"SUM(目標ごとの達成度!AK42:AK51)","v":0},{"$f":"IF(E6=0,0,SUM($P6:P6)/E6)","v":0},{"$f":"IF(F6=0,0,SUM($P6:Q6)/F6)","v":0},{"$f":"IF(G6=0,0,SUM($P6:R6)/G6)","v":0},{"$f":"IF(H6=0,0,SUM($P6:S6)/H6)","v":0},{"$f":"IF(I6=0,0,SUM($P6:T6)/I6)","v":0},{"$f":"IF(J6=0,0,SUM($P6:U6)/J6)","v":0},{"$f":"IF(K6=0,0,SUM($P6:V6)/K6)","v":0},{"$f":"IF(L6=0,0,SUM($P6:W6)/L6)","v":0},{"$f":"IF(M6=0,0,SUM($P6:X6)/M6)","v":0},{"$f":"IF(N6=0,0,SUM($P6:Y6)/N6)","v":0},{"$f":"IF(O6=0,0,SUM($P6:Z6)/O6)","v":0}]
["(E) 自主学習",{"$f":"SUM(目標ごとの達成度!N52:N60)","v":0},{"$f":"SUM(目標ごとの達成度!M52:M60)","v":0},{"$error":"#DIV/0!"},{"$f":"SUM(目標ごとの達成度!$P52:P60)","v":0},{"$f":"SUM(目標ごとの達成度!$P52:Q60)","v":0},{"$f":"SUM(目標ごとの達成度!$P52:R60)","v":0},{"$f":"SUM(目標ごとの達成度!$P52:S60)","v":0},{"$f":"SUM(目標ごとの達成度!$P52:T60)","v":0},{"$f":"SUM(目標ごとの達成度!$P52:U60)","v":0},{"$f":"SUM(目標ごとの達成度!$P52:V60)","v":0},{"$f":"SUM(目標ごとの達成度!$P52:W60)","v":0},{"$f":"SUM(目標ごとの達成度!$P52:X60)","v":0},{"$f":"SUM(目標ごとの達成度!$P52:Y60)","v":0},{"$f":"SUM(目標ごとの達成度!$P52:Z60)","v":0},{"$f":"SUM(目標ごとの達成度!$AA52:AA60)","v":0},{"$f":"SUM(目標ごとの達成度!AB52:AB60)","v":0},{"$f":"SUM(目標ごとの達成度!AC52:AC60)","v":0},{"$f":"SUM(目標ごとの達成度!AD52:AD60)","v":0},{"$f":"SUM(目標ごとの達成度!AE52:AE60)","v":0},{"$f":"SUM(目標ごとの達成度!AF52:AF60)","v":0},{"$f":"SUM(目標ごとの達成度!AG52:AG60)","v":0},{"$f":"SUM(目標ごとの達成度!AH52:AH60)","v":0},{"$f":"SUM(目標ごとの達成度!AI52:AI60)","v":0},{"$f":"SUM(目標ごとの達成度!AJ52:AJ60)","v":0},{"$f":"SUM(目標ごとの達成度!AK52:AK60)","v":0},{"$f":"IF(E7=0,0,SUM($P7:P7)/E7)","v":0},{"$f":"IF(F7=0,0,SUM($P7:Q7)/F7)","v":0},{"$f":"IF(G7=0,0,SUM($P7:R7)/G7)","v":0},{"$f":"IF(H7=0,0,SUM($P7:S7)/H7)","v":0},{"$f":"IF(I7=0,0,SUM($P7:T7)/I7)","v":0},{"$f":"IF(J7=0,0,SUM($P7:U7)/J7)","v":0},{"$f":"IF(K7=0,0,SUM($P7:V7)/K7)","v":0},{"$f":"IF(L7=0,0,SUM($P7:W7)/L7)","v":0},{"$f":"IF(M7=0,0,SUM($P7:X7)/M7)","v":0},{"$f":"IF(N7=0,0,SUM($P7:Y7)/N7)","v":0},{"$f":"IF(O7=0,0,SUM($P7:Z7)/O7)","v":0}]
["(F) チームによる実体験",{"$f":"SUM(目標ごとの達成度!N61:N66)","v":0},{"$f":"SUM(目標ごとの達成度!M61:M66)","v":0},{"$error":"#DIV/0!"},{"$f":"SUM(目標ごとの達成度!$P61:P66)","v":0},{"$f":"SUM(目標ごとの達成度!$P61:Q66)","v":0},{"$f":"SUM(目標ごとの達成度!$P61:R66)","v":0},{"$f":"SUM(目標ごとの達成度!$P61:S66)","v":0},{"$f":"SUM(目標ごとの達成度!$P61:T66)","v":0},{"$f":"SUM(目標ごとの達成度!$P61:U66)","v":0},{"$f":"SUM(目標ごとの達成度!$P61:V66)","v":0},{"$f":"SUM(目標ごとの達成度!$P61:W66)","v":0},{"$f":"SUM(目標ごとの達成度!$P61:X66)","v":0},{"$f":"SUM(目標ごとの達成度!$P61:Y66)","v":0},{"$f":"SUM(目標ごとの達成度!$P61:Z66)","v":0},{"$f":"SUM(目標ごとの達成度!$AA61:AA66)","v":0},{"$f":"SUM(目標ごとの達成度!AB61:AB66)","v":0},{"$f":"SUM(目標ごとの達成度!AC61:AC66)","v":0},{"$f":"SUM(目標ごとの達成度!AD61:AD66)","v":0},{"$f":"SUM(目標ごとの達成度!AE61:AE66)","v":0},{"$f":"SUM(目標ごとの達成度!AF61:AF66)","v":0},{"$f":"SUM(目標ごとの達成度!AG61:AG66)","v":0},{"$f":"SUM(目標ごとの達成度!AH61:AH66)","v":0},{"$f":"SUM(目標ごとの達成度!AI61:AI66)","v":0},{"$f":"SUM(目標ごとの達成度!AJ61:AJ66)","v":0},{"$f":"SUM(目標ごとの達成度!AK61:AK66)","v":0},{"$f":"IF(E8=0,0,SUM($P8:P8)/E8)","v":0},{"$f":"IF(F8=0,0,SUM($P8:Q8)/F8)","v":0},{"$f":"IF(G8=0,0,SUM($P8:R8)/G8)","v":0},{"$f":"IF(H8=0,0,SUM($P8:S8)/H8)","v":0},{"$f":"IF(I8=0,0,SUM($P8:T8)/I8)","v":0},{"$f":"IF(J8=0,0,SUM($P8:U8)/J8)","v":0},{"$f":"IF(K8=0,0,SUM($P8:V8)/K8)","v":0},{"$f":"IF(L8=0,0,SUM($P8:W8)/L8)","v":0},{"$f":"IF(M8=0,0,SUM($P8:X8)/M8)","v":0},{"$f":"IF(N8=0,0,SUM($P8:Y8)/N8)","v":0},{"$f":"IF(O8=0,0,SUM($P8:Z8)/O8)","v":0}]
{"$rows_left_out":13}