{"text_format":"1","workbook":"xlsx","n_sheets":9,"sheets":["共通科目","専門科目","集計結果・土木GPT","印刷-単位取得状況　総括表(P.3)","印刷-総括表(P.4)","印刷-目標ごとの達成度(P.7-8)","GPT","GPA","グラフ用データ"],"not_rendered":{"charts":4,"images":0,"macros":1,"external_links":0,"defined_names":11,"comments":0,"pivot_tables":0},"unopened":[{"sheet":"GPT","index":6,"reason":"not_a_worksheet"},{"sheet":"GPA","index":7,"reason":"not_a_worksheet"}],"bounds":{"document_bytes":16777216,"sheet_cells":100000,"rows_first":2000,"rows_last":500,"rows_between":2000,"halvings":0,"cell_chars":16384,"cell_head_chars":4096},"cells_cut":0,"cells_raw":0,"read":"whole","date_system":"1900"}

{"sheet":"共通科目","index":0,"n_rows":94,"n_cols":45,"rows_kept":94,"cut":false,"hidden":false,"merged":[[5,2,12,2],[5,1,41,1],[21,2,32,2],[57,1,66,2],[67,1,70,2],[78,2,87,2],[90,2,92,2],[42,1,56,2],[33,2,41,2],[13,2,20,2],[71,2,77,2],[71,1,92,1],[0,3,0,16],[3,7,3,8],[3,9,3,10],[2,1,4,2],[2,3,4,4],[2,16,4,16],[2,5,3,6],[2,15,4,15],[2,7,2,14],[3,11,3,12],[3,13,3,14],[78,12,87,12],[78,11,87,11],[3,23,3,33],[3,34,3,44],[1,3,1,16],[5,7,29,7],[5,8,29,8],[5,9,29,9],[5,10,29,10],[33,7,41,7],[33,8,41,8],[33,9,41,9],[33,10,41,10]]}
[null,null,null,"共通科目チェックシート"]
[null,null,null,"黄色背景の成績欄をドロップダウンリストによって入力すること\nバグや不具合があれば，クラス担当まで連絡すること"]
[null,"区分",null,"授業科目名\n（○：土木GPT対応科目）",null,"単位数",null,"毎週授業時間数",null,null,null,null,null,null,null,"単位取得\n年度・学期","成績"]
[null,null,null,null,null,null,null,"1年次",null,"2年次",null,"3年次",null,"4年次",null,null,null,null,null,null,null,null,null,"取得単位",null,null,null,null,null,null,null,null,null,null,"Civil-GP: Grade Point"]
[null,null,null,null,null,"必修","選択","前期","後期","前期","後期","前期","後期","前期","後期",null,null,null,"必修単位","選択単位","GP","土木GP","学期",1,2,3,4,5,6,7,8,9,10,11,1,2,3,4,5,6,7,8,9,10,11]
[null,"人間社会","技術と人間・心理","○","心理学",null,2,4,2,2,2,null,null,null,null,null,null,null,{"$f":"IF($Q6=\"\",0,IF(INDEX('印刷-目標ごとの達成度(P.7-8)'!$P$94:$P$102,MATCH($Q6,'印刷-目標ごとの達成度(P.7-8)'!$O$94:$O$102,0),1)>0,1,0))*F6","v":0},{"$f":"IF($Q6=\"\",0,IF(INDEX('印刷-目標ごとの達成度(P.7-8)'!$P$94:$P$102,MATCH($Q6,'印刷-目標ごとの達成度(P.7-8)'!$O$94:$O$102,0),1)>0,1,0))*G6","v":0},{"$f":"IF($Q6=\"\",0,INDEX('印刷-目標ごとの達成度(P.7-8)'!$P$94:$P$102,MATCH($Q6,'印刷-目標ごとの達成度(P.7-8)'!$O$94:$O$102,0),1))*(F6+G6)","v":0},{"$f":"IF(OR(D6=\"○\",D6=\"◎\"),U6,0)","v":0},{"$f":"IF(P6=\"\",99,INDEX('印刷-目標ごとの達成度(P.7-8)'!$N$108:$N$118,MATCH(P6,'印刷-目標ごとの達成度(P.7-8)'!$O$108:$O$118,0),1))","v":99},{"$f":"IF($W6=X$5,$S6+$T6,0)","v":0},{"$f":"IF($W6=Y$5,$S6+$T6,0)","v":0},0,0,0,0,0,0,0,0,0,{"$f":"IF($W6=AI$5,$V6,0)","v":0},{"$f":"IF($W6=AJ$5,$V6,0)","v":0},0,0,0,0,0,0,0,0,0]
{"$rows_left_out":89}
{"sheet":"専門科目","index":1,"n_rows":51,"n_cols":43,"rows_kept":51,"cut":false,"hidden":false,"merged":[[2,14,4,14],[0,3,0,15],[1,3,1,15],[3,10,3,11],[24,2,35,2],[2,15,4,15],[5,2,9,2],[3,12,3,13],[36,2,47,2],[5,1,49,1],[10,2,23,2],[2,6,2,13],[2,1,4,2],[2,3,4,3],[2,4,3,5],[3,6,3,7],[3,8,3,9]]}
[null,null,null,"専門科目チェックシート"]
[null,null,null,"黄色背景の成績欄をドロップダウンリストによって入力すること\nバグや不具合があれば，クラス担当まで連絡すること"]
[null,"区分",null,"授業科目名\n（すべて土木GPT対応科目）","単位数",null,"毎週授業時間数",null,null,null,null,null,null,null,"単位取得\n年度・学期","成績"]
[null,null,null,null,null,null,"1年次",null,"2年次",null,"3年次",null,"4年次"]
[null,null,null,null,"必修","選択","前期","後期","前期","後期","前期","後期","前期","後期",null,null,null,"必修単位","選択単位","GP","学期",1,2,3,4,5,6,7,8,9,10,11,1,2,3,4,5,6,7,8,9,10,11]
[null,"専門教育科目","学科共通科目","社会工学概論",2,null,2,null,null,null,null,null,null,null,null,null,null,{"$f":"IF($P6=\"\",0,IF(INDEX('印刷-目標ごとの達成度(P.7-8)'!$P$94:$P$102,MATCH($P6,'印刷-目標ごとの達成度(P.7-8)'!$O$94:$O$102,0),1)>0,1,0))*E6","v":0},{"$f":"IF($P6=\"\",0,IF(INDEX('印刷-目標ごとの達成度(P.7-8)'!$P$94:$P$102,MATCH($P6,'印刷-目標ごとの達成度(P.7-8)'!$O$94:$O$102,0),1)>0,1,0))*F6","v":0},{"$f":"IF($P6=\"\",0,INDEX('印刷-目標ごとの達成度(P.7-8)'!$P$94:$P$102,MATCH($P6,'印刷-目標ごとの達成度(P.7-8)'!$O$94:$O$102,0),1))*(E6+F6)","v":0},{"$f":"IF(O6=\"\",99,INDEX('印刷-目標ごとの達成度(P.7-8)'!$N$108:$N$118,MATCH(O6,'印刷-目標ごとの達成度(P.7-8)'!$O$108:$O$118,0),1))","v":99},{"$f":"IF($U6=V$5,$R6+$S6,0)","v":0},{"$f":"IF($U6=W$5,$R6+$S6,0)","v":0},0,0,0,0,0,0,0,0,0,{"$f":"IF($U6=AG$5,$T6,0)","v":0},{"$f":"IF($U6=AH$5,$T6,0)","v":0},0,0,0,0,0,0,0,0,0]
{"$rows_left_out":46}
{"sheet":"集計結果・土木GPT","index":2,"n_rows":35,"n_cols":10,"rows_kept":35,"cut":false,"hidden":false,"merged":[[0,1,0,9],[1,3,1,5],[1,1,2,2],[1,8,2,9],[2,3,2,4],[1,6,2,7],[12,8,12,9],[13,8,13,9],[3,1,7,1],[12,1,12,2],[3,7,7,7],[3,9,7,9],[3,4,7,4],[12,6,12,7],[13,6,13,7],[12,3,12,4],[13,3,13,4],[13,1,13,2],[8,1,11,1],[8,4,11,4],[8,7,11,7],[8,9,11,9],[29,1,32,1],[29,3,29,5],[29,6,32,7],[30,3,30,5],[31,3,31,5],[32,3,32,5],[33,1,33,2],[33,3,33,9],[34,1,34,2],[34,3,34,9],[15,6,15,7],[15,3,15,5],[24,1,24,2],[24,3,24,9],[25,1,28,1],[25,3,25,5],[25,6,28,7],[23,1,23,9],[25,8,32,9],[26,3,26,5],[27,3,27,5],[28,3,28,5]]}
[null,"集計結果"]
[null,"科目区分",null,"取得単位数",null,null,"GPT(参考値)",null,"GPA(参考値)"]
[null,null,null,"必修＋選択",null,"必修"]
[null,"共通科目","人間社会",{"$f":"SUM(共通科目!S6:T42)","v":0},{"$f":"SUM(D4:D8)","v":0},{"$f":"SUM(共通科目!S6:S42)","v":0},{"$f":"SUM(共通科目!U6:U42)","v":0},{"$f":"SUM(G4:G8)","v":0},{"$f":"IF(D4=0,0,G4/D4)","v":0},{"$f":"IF(E4=0,0,H4/E4)","v":0}]
[null,null,"自然科学基礎",{"$f":"SUM(共通科目!S43:T57)","v":0},null,{"$f":"SUM(共通科目!S43:S57)","v":0},{"$f":"SUM(共通科目!U43:U57)","v":0},null,{"$f":"IF(D5=0,0,G5/D5)","v":0}]
[null,null,"グローバルコミュニケーション",{"$f":"SUM(共通科目!S58:T67)","v":0},null,{"$f":"SUM(共通科目!S58:S67)","v":0},{"$f":"SUM(共通科目!U58:U67)","v":0},null,{"$f":"IF(D6=0,0,G6/D6)","v":0}]
{"$rows_left_out":30}
{"sheet":"印刷-単位取得状況　総括表(P.3)","index":3,"n_rows":38,"n_cols":13,"rows_kept":38,"cut":false,"hidden":false,"merged":[[27,1,27,2],[12,1,12,2],[17,1,17,12],[18,1,18,12],[11,1,11,2],[13,1,13,2],[14,1,14,2],[16,1,16,12],[2,3,2,12],[1,1,1,12],[5,1,10,1],[3,3,3,4],[2,1,4,2],[34,3,34,5],[35,3,35,5],[26,1,26,12],[0,10,0,12],[0,8,0,9],[20,1,20,12],[21,1,21,2],[22,1,22,2],[23,1,23,2],[21,3,21,12],[22,3,22,12],[23,3,23,12],[3,5,3,6],[3,7,3,8],[3,9,3,10],[3,11,3,12],[36,1,36,2],[36,3,36,9],[37,1,37,2],[37,3,37,9],[27,3,27,9],[28,1,31,1],[28,3,28,5],[28,6,31,7],[28,8,35,9],[29,3,29,5],[30,3,30,5],[31,3,31,5],[32,1,35,1],[32,3,32,5],[32,6,35,7],[33,3,33,5]]}
[null,null,"入学年度：",{"$f":"'印刷-目標ごとの達成度(P.7-8)'!$P$105","v":2024},"年度",null,null,null,"現在の日時：",null,{"$f":"NOW()","v":"2025-03-18T20:59:52.140"}]
[null,"単位取得状況　総括表 "]
[null,"科目区分",null,"取得単位数（累計）"]
[null,null,null,"１年",null,"２年",null,"３年",null,"４年"]
[null,null,null,"前期","後期","前期","後期","前期","後期","前期","後期"]
[null,"共通科目","人間社会",{"$f":"IF(D$16>$K$1,\"\",SUM(共通科目!$X6:X42))","v":0},{"$f":"IF(E$16>$K$1,\"\",SUM(共通科目!$Y6:Y42))","v":0},{"$f":"IF(F$16>$K$1,\"\",SUM(共通科目!$Z6:Z42))","v":""},{"$f":"IF(G$16>$K$1,\"\",SUM(共通科目!$AA6:AA42))","v":""},{"$f":"IF(H$16>$K$1,\"\",SUM(共通科目!AB6:AB42))","v":""},{"$f":"IF(I$16>$K$1,\"\",SUM(共通科目!AC6:AC42))","v":""},{"$f":"IF(J$16>$K$1,\"\",SUM(共通科目!AD6:AD42))","v":""},{"$f":"IF(K$16>$K$1,\"\",SUM(共通科目!AE6:AE42))","v":""},{"$f":"IF(L$16>$K$1,\"\",SUM(共通科目!AF6:AF42))","v":""},{"$f":"IF(M$16>$K$1,\"\",SUM(共通科目!AG6:AG42))","v":""}]
{"$rows_left_out":33}
{"sheet":"印刷-総括表(P.4)","index":4,"n_rows":32,"n_cols":12,"rows_kept":32,"cut":false,"hidden":false,"merged":[[24,0,24,1],[22,0,22,1],[23,0,23,1],[1,0,1,11],[2,0,2,11],[16,0,17,0],[19,0,20,0],[3,0,5,1],[6,0,7,0],[8,0,10,0],[11,0,13,0],[0,8,0,11],[4,4,4,5],[4,6,4,7],[4,8,4,9],[3,2,3,11],[4,10,4,11],[4,2,4,3]]}
[null,"入学年度：",{"$f":"'印刷-目標ごとの達成度(P.7-8)'!$P$105","v":2024},"年度",null,null,null,null,{"$f":"NOW()","v":"2025-03-18T20:59:52.140"}]
["「学習・教育到達目標」達成状況の総括表"]
["※学期ごとに，これらの数値をＪノートの総括表に転記すること"]
["学習・教育目標",null,"目標ごとの取得単位数（累計）"]
[null,null,"１年",null,"２年",null,"３年",null,"４年"]
[null,null,"前期","後期","前期","後期","前期","後期","前期","後期","前期","後期"]
{"$rows_left_out":27}
{"sheet":"印刷-目標ごとの達成度(P.7-8)","index":5,"n_rows":118,"n_cols":60,"rows_kept":118,"cut":false,"hidden":false,"merged":[[86,1,91,1],[90,3,90,4],[88,3,88,4],[89,3,89,4],[84,3,84,4],[86,3,86,4],[87,3,87,4],[78,3,78,4],[80,3,80,4],[91,3,91,4],[83,3,83,4],[81,3,81,4],[41,11,50,11],[48,3,48,4],[25,10,40,10],[43,3,43,4],[51,11,59,11],[51,1,59,1],[25,11,40,11],[57,3,57,4],[71,1,85,1],[79,3,79,4],[25,1,40,1],[41,1,50,1],[25,3,25,4],[56,3,56,4],[60,1,65,1],[70,3,70,4],[68,3,68,4],[42,3,42,4],[71,3,71,4],[71,10,85,10],[82,3,82,4],[85,3,85,4],[69,3,69,4],[41,10,50,10],[12,3,12,4],[18,3,18,4],[41,0,65,0],[41,9,50,9],[25,9,40,9],[27,3,27,4],[60,3,60,4],[65,3,65,4],[24,3,24,4],[64,3,64,4],[63,3,63,4],[62,3,62,4],[61,3,61,4],[73,3,73,4],[76,3,76,4],[77,3,77,4],[75,3,75,4],[26,3,26,4],[3,3,3,4],[8,3,8,4],[86,11,91,11],[86,9,91,9],[71,9,85,9],[86,10,91,10],[66,3,66,4],[72,3,72,4],[23,3,23,4],[5,3,5,4],[51,9,59,9],[52,3,52,4],[53,3,53,4],[50,3,50,4],[47,3,47,4],[54,3,54,4],[51,3,51,4],[55,3,55,4],[59,3,59,4],[12,9,24,9],[67,3,67,4],[71,11,85,11],[12,10,24,10],[74,3,74,4],[0,0,0,11],[17,3,17,4],[1,0,1,1],[2,11,11,11],[12,11,24,11],[10,3,10,4],[11,3,11,4],[16,3,16,4],[21,3,21,4],[22,3,22,4],[9,3,9,4],[2,0,40,0],[29,3,29,4],[2,1,11,1],[28,3,28,4],[30,3,40,3],[13,3,13,4],[2,9,11,9],[12,1,24,1],[19,3,19,4],[6,3,6,4],[7,3,7,4],[14,3,14,4],[2,3,2,4],[0,49,0,59],[0,16,0,26],[0,27,0,37],[0,38,0,48],[66,0,91,0],[66,1,70,1],[60,9,65,9],[60,10,65,10],[60,11,65,11],[66,9,70,9],[66,10,70,10],[66,11,70,11],[1,3,1,4],[41,3,41,4],[20,3,20,4],[4,3,4,4],[15,3,15,4],[58,3,58,4],[51,10,59,10],[45,3,45,4],[46,3,46,4],[44,3,44,4],[49,3,49,4],[2,10,11,10]]}
["「学習・教育到達目標」達成状況 自己チェックシート\n統合チェックシート（EXCEL版）は学科HP（http://www.cm.nitech.ac.jp/civil/）の「学生支援（在学生向け）」より入手のこと",null,null,null,null,null,null,null,null,null,null,null,null,null,null,null,"取得単位数",null,null,null,null,null,null,null,null,null,null,"GPT",null,null,null,null,null,null,null,null,null,null,"取得科目数",null,null,null,null,null,null,null,null,null,null,"取得単位数（必修）"]
["学習・教育到達目標",null,"◎必修フラグ","関連する科目（◎必修）",null,"開講時期","単位数","単位取得\n年度・学期","成績","取得\n単位数","GPT","GPA",null,"点数","取得単位数","学期",1,2,3,4,5,6,7,8,9,10,11,1,2,3,4,5,6,7,8,9,10,11,1,2,3,4,5,6,7,8,9,10,11,1,2,3,4,5,6,7,8,9,10,11]
["Ⅰ　幅広い教養と技術者倫理","(A) 科学技術基礎\n(科学技術の共通基礎科目として数学・外国語・情報処理能力を習得する)",1,"◎線形代数Ⅰ",null,"１年前期",2,{"$f":"VLOOKUP(RIGHT(D3,LEN(D3)-1),共通科目!E$6:Q$93,12,FALSE)&\"\"","v":""},{"$f":"VLOOKUP(RIGHT(D3,LEN(D3)-1),共通科目!E$6:Q$93,13,FALSE)&\"\"","v":""},{"$f":"SUM(O3:O12)","v":0},{"$f":"IF(SUM(O3:O12)=0,\"0\",SUM(N3:N12))","v":"0"},{"$f":"IF(SUM(O3:O12)=0,\"0\",SUM(N3:N12)/SUM(O3:O12))","v":"0"},null,{"$f":"IF(OR(G3=\"\",I3=\"\"),0,G3*INDEX($P$94:$P$103,MATCH(I3,$O$94:$O$103,0),1))","v":0},{"$f":"IF(OR(G3=\"\",I3=\"\"),0,G3*IF(INDEX($P$94:$P$103,MATCH(I3,$O$94:$O$103,0),1)>0,1,0))","v":0},{"$f":"IF(H3=\"\",99,INDEX($N$108:$N$118,MATCH(H3,$O$108:$O$118,0),1))","v":99},{"$f":"IF($P3=AB$2,$O3,0)","v":0},{"$f":"IF($P3=AC$2,$O3,0)","v":0},{"$f":"IF($P3=AD$2,$O3,0)","v":0},{"$f":"IF($P3=AE$2,$O3,0)","v":0},{"$f":"IF($P3=AF$2,$O3,0)","v":0},{"$f":"IF($P3=AG$2,$O3,0)","v":0},{"$f":"IF($P3=AH$2,$O3,0)","v":0},{"$f":"IF($P3=AI$2,$O3,0)","v":0},{"$f":"IF($P3=AJ$2,$O3,0)","v":0},{"$f":"IF($P3=AK$2,$O3,0)","v":0},{"$f":"IF($P3=AL$2,$O3,0)","v":0},{"$f":"IF($P3=AB$2,$N3,0)","v":0},{"$f":"IF($P3=AC$2,$N3,0)","v":0},{"$f":"IF($P3=AD$2,$N3,0)","v":0},0,0,0,0,0,0,0,0,{"$f":"IF($P3=AB$2,ROUND($N3/$N3,0),0)","v":0},{"$f":"IF($P3=AC$2,ROUND($N3/$N3,0),0)","v":0},{"$f":"IF($P3=AD$2,ROUND($N3/$N3,0),0)","v":0},0,0,0,0,0,0,0,0,{"$f":"IF($C3=1,IF($P3=AX$2,$O3,0),0)","v":0},{"$f":"IF($C3=1,IF($P3=AY$2,$O3,0),0)","v":0},{"$f":"IF($C3=1,IF($P3=AZ$2,$O3,0),0)","v":0},0,0,0,0,0,{"$f":"IF($C3=1,IF($P3=BF$2,$O3,0),0)","v":0},0,0]
[null,null,1,"◎線形代数Ⅱ",null,"１年後期",2,{"$f":"VLOOKUP(RIGHT(D4,LEN(D4)-1),共通科目!E$6:Q$93,12,FALSE)&\"\"","v":""},{"$f":"VLOOKUP(RIGHT(D4,LEN(D4)-1),共通科目!E$6:Q$93,13,FALSE)&\"\"","v":""},null,null,null,null,0,0,99,{"$f":"IF($P4=AB$2,$O4,0)","v":0},0,0,0,{"$f":"IF($P4=AF$2,$O4,0)","v":0},0,0,0,0,0,0,{"$f":"IF($P4=AB$2,$N4,0)","v":0},0,0,0,0,0,0,0,0,0,0,{"$f":"IF($P4=AB$2,ROUND($N4/$N4,0),0)","v":0},0,0,0,0,0,0,0,0,0,0,{"$f":"IF($C4=1,IF($P4=AX$2,$O4,0),0)","v":0},{"$f":"IF($C4=1,IF($P4=AY$2,$O4,0),0)","v":0},0,0,0,0,0,0,0,0,0]
[null,null,1,"◎微分積分Ⅰ及び演習",null,"１年前期",3,{"$f":"VLOOKUP(RIGHT(D5,LEN(D5)-1),共通科目!E$6:Q$93,12,FALSE)&\"\"","v":""},{"$f":"VLOOKUP(RIGHT(D5,LEN(D5)-1),共通科目!E$6:Q$93,13,FALSE)&\"\"","v":""},null,null,null,null,0,0,99,{"$f":"IF($P5=AB$2,$O5,0)","v":0},0,0,0,0,0,0,0,0,0,0,{"$f":"IF($P5=AB$2,$N5,0)","v":0},0,0,0,0,0,0,0,0,0,0,0,0,0,0,0,0,0,0,0,0,0,0,0,0,0,0,0,0,0,0,0,0]
[null,null,0,"　微分積分Ⅱ及び演習",null,"１年後期",3,{"$f":"VLOOKUP(RIGHT(D6,LEN(D6)-1),共通科目!E$6:Q$93,12,FALSE)&\"\"","v":""},{"$f":"VLOOKUP(RIGHT(D6,LEN(D6)-1),共通科目!E$6:Q$93,13,FALSE)&\"\"","v":""},null,null,null,null,0,0,99,0,0,0,0,0,0,0,0,0,0,0,0,0,0,0,0,0,0,0,0,0,0,0,0,0,0,0,0,0,0,0,0,0,0,0,0,0,0,0,0,0,0,0,0]
{"$rows_left_out":113}
{"sheet":"グラフ用データ","index":8,"n_rows":21,"n_cols":37,"rows_kept":21,"cut":false,"hidden":false,"merged":[[0,26,0,36],[0,15,0,25],[0,0,1,0],[0,2,1,2],[0,1,1,1],[0,3,1,3],[0,4,0,14]]}
["学習・教育到達目標","取得\n単位数","GPT","GPA","各期の累計取得単位数",null,null,null,null,null,null,null,null,null,null,"各期のGPT",null,null,null,null,null,null,null,null,null,null,"各期の累計GPA"]
[null,null,null,null,{"$f":"'印刷-目標ごとの達成度(P.7-8)'!Q2","v":1},{"$f":"'印刷-目標ごとの達成度(P.7-8)'!R2","v":2},{"$f":"'印刷-目標ごとの達成度(P.7-8)'!S2","v":3},{"$f":"'印刷-目標ごとの達成度(P.7-8)'!T2","v":4},{"$f":"'印刷-目標ごとの達成度(P.7-8)'!U2","v":5},{"$f":"'印刷-目標ごとの達成度(P.7-8)'!V2","v":6},{"$f":"'印刷-目標ごとの達成度(P.7-8)'!W2","v":7},{"$f":"'印刷-目標ごとの達成度(P.7-8)'!X2","v":8},{"$f":"'印刷-目標ごとの達成度(P.7-8)'!Y2","v":9},{"$f":"'印刷-目標ごとの達成度(P.7-8)'!Z2","v":10},{"$f":"'印刷-目標ごとの達成度(P.7-8)'!AA2","v":11},{"$f":"E2","v":1},2,3,4,5,6,7,8,9,10,11,{"$f":"E2","v":1},2,3,4,5,6,7,8,9,10,11]
["(A) 科学技術基礎",{"$f":"SUM('印刷-目標ごとの達成度(P.7-8)'!O3:O12)","v":0},{"$f":"SUM('印刷-目標ごとの達成度(P.7-8)'!N3:N12)","v":0},{"$f":"C3/B3","v":{"$error":"#DIV/0!"}},{"$f":"SUM('印刷-目標ごとの達成度(P.7-8)'!$Q3:Q12)","v":0},{"$f":"SUM('印刷-目標ごとの達成度(P.7-8)'!$Q3:R12)","v":0},{"$f":"SUM('印刷-目標ごとの達成度(P.7-8)'!$Q3:S12)","v":0},{"$f":"SUM('印刷-目標ごとの達成度(P.7-8)'!$Q3:T12)","v":0},{"$f":"SUM('印刷-目標ごとの達成度(P.7-8)'!$Q3:U12)","v":0},{"$f":"SUM('印刷-目標ごとの達成度(P.7-8)'!$Q3:V12)","v":0},{"$f":"SUM('印刷-目標ごとの達成度(P.7-8)'!$Q3:W12)","v":0},{"$f":"SUM('印刷-目標ごとの達成度(P.7-8)'!$Q3:X12)","v":0},{"$f":"SUM('印刷-目標ごとの達成度(P.7-8)'!$Q3:Y12)","v":0},{"$f":"SUM('印刷-目標ごとの達成度(P.7-8)'!$Q3:Z12)","v":0},{"$f":"SUM('印刷-目標ごとの達成度(P.7-8)'!$Q3:AA12)","v":0},{"$f":"SUM('印刷-目標ごとの達成度(P.7-8)'!$AB3:AB12)","v":0},{"$f":"SUM('印刷-目標ごとの達成度(P.7-8)'!AC3:AC12)","v":0},{"$f":"SUM('印刷-目標ごとの達成度(P.7-8)'!AD3:AD12)","v":0},{"$f":"SUM('印刷-目標ごとの達成度(P.7-8)'!AE3:AE12)","v":0},{"$f":"SUM('印刷-目標ごとの達成度(P.7-8)'!AF3:AF12)","v":0},{"$f":"SUM('印刷-目標ごとの達成度(P.7-8)'!AG3:AG12)","v":0},{"$f":"SUM('印刷-目標ごとの達成度(P.7-8)'!AH3:AH12)","v":0},{"$f":"SUM('印刷-目標ごとの達成度(P.7-8)'!AI3:AI12)","v":0},{"$f":"SUM('印刷-目標ごとの達成度(P.7-8)'!AJ3:AJ12)","v":0},{"$f":"SUM('印刷-目標ごとの達成度(P.7-8)'!AK3:AK12)","v":0},{"$f":"SUM('印刷-目標ごとの達成度(P.7-8)'!AL3:AL12)","v":0},{"$f":"IF(E3=0,0,SUM($P3:P3)/E3)","v":0},{"$f":"IF(F3=0,0,SUM($P3:Q3)/F3)","v":0},{"$f":"IF(G3=0,0,SUM($P3:R3)/G3)","v":0},{"$f":"IF(H3=0,0,SUM($P3:S3)/H3)","v":0},{"$f":"IF(I3=0,0,SUM($P3:T3)/I3)","v":0},{"$f":"IF(J3=0,0,SUM($P3:U3)/J3)","v":0},{"$f":"IF(K3=0,0,SUM($P3:V3)/K3)","v":0},{"$f":"IF(L3=0,0,SUM($P3:W3)/L3)","v":0},{"$f":"IF(M3=0,0,SUM($P3:X3)/M3)","v":0},{"$f":"IF(N3=0,0,SUM($P3:Y3)/N3)","v":0},{"$f":"IF(O3=0,0,SUM($P3:Z3)/O3)","v":0}]
["(B) 自然科学",{"$f":"SUM('印刷-目標ごとの達成度(P.7-8)'!O13:O25)","v":0},{"$f":"SUM('印刷-目標ごとの達成度(P.7-8)'!N13:N25)","v":0},{"$error":"#DIV/0!"},{"$f":"SUM('印刷-目標ごとの達成度(P.7-8)'!$Q13:Q25)","v":0},{"$f":"SUM('印刷-目標ごとの達成度(P.7-8)'!$Q13:R25)","v":0},{"$f":"SUM('印刷-目標ごとの達成度(P.7-8)'!$Q13:S25)","v":0},{"$f":"SUM('印刷-目標ごとの達成度(P.7-8)'!$Q13:T25)","v":0},{"$f":"SUM('印刷-目標ごとの達成度(P.7-8)'!$Q13:U25)","v":0},{"$f":"SUM('印刷-目標ごとの達成度(P.7-8)'!$Q13:V25)","v":0},{"$f":"SUM('印刷-目標ごとの達成度(P.7-8)'!$Q13:W25)","v":0},{"$f":"SUM('印刷-目標ごとの達成度(P.7-8)'!$Q13:X25)","v":0},{"$f":"SUM('印刷-目標ごとの達成度(P.7-8)'!$Q13:Y25)","v":0},{"$f":"SUM('印刷-目標ごとの達成度(P.7-8)'!$Q13:Z25)","v":0},{"$f":"SUM('印刷-目標ごとの達成度(P.7-8)'!$Q13:AA25)","v":0},{"$f":"SUM('印刷-目標ごとの達成度(P.7-8)'!$AB13:AB25)","v":0},{"$f":"SUM('印刷-目標ごとの達成度(P.7-8)'!AC13:AC25)","v":0},{"$f":"SUM('印刷-目標ごとの達成度(P.7-8)'!AD13:AD25)","v":0},{"$f":"SUM('印刷-目標ごとの達成度(P.7-8)'!AE13:AE25)","v":0},{"$f":"SUM('印刷-目標ごとの達成度(P.7-8)'!AF13:AF25)","v":0},{"$f":"SUM('印刷-目標ごとの達成度(P.7-8)'!AG13:AG25)","v":0},{"$f":"SUM('印刷-目標ごとの達成度(P.7-8)'!AH13:AH25)","v":0},{"$f":"SUM('印刷-目標ごとの達成度(P.7-8)'!AI13:AI25)","v":0},{"$f":"SUM('印刷-目標ごとの達成度(P.7-8)'!AJ13:AJ25)","v":0},{"$f":"SUM('印刷-目標ごとの達成度(P.7-8)'!AK13:AK25)","v":0},{"$f":"SUM('印刷-目標ごとの達成度(P.7-8)'!AL13:AL25)","v":0},{"$f":"IF(E4=0,0,SUM($P4:P4)/E4)","v":0},{"$f":"IF(F4=0,0,SUM($P4:Q4)/F4)","v":0},{"$f":"IF(G4=0,0,SUM($P4:R4)/G4)","v":0},{"$f":"IF(H4=0,0,SUM($P4:S4)/H4)","v":0},{"$f":"IF(I4=0,0,SUM($P4:T4)/I4)","v":0},{"$f":"IF(J4=0,0,SUM($P4:U4)/J4)","v":0},{"$f":"IF(K4=0,0,SUM($P4:V4)/K4)","v":0},{"$f":"IF(L4=0,0,SUM($P4:W4)/L4)","v":0},{"$f":"IF(M4=0,0,SUM($P4:X4)/M4)","v":0},{"$f":"IF(N4=0,0,SUM($P4:Y4)/N4)","v":0},{"$f":"IF(O4=0,0,SUM($P4:Z4)/O4)","v":0}]
["(C) 多面的思考と倫理",{"$f":"SUM('印刷-目標ごとの達成度(P.7-8)'!O26:O41)","v":0},{"$f":"SUM('印刷-目標ごとの達成度(P.7-8)'!N26:N41)","v":0},{"$error":"#DIV/0!"},{"$f":"SUM('印刷-目標ごとの達成度(P.7-8)'!$Q26:Q41)","v":0},{"$f":"SUM('印刷-目標ごとの達成度(P.7-8)'!$Q26:R41)","v":0},{"$f":"SUM('印刷-目標ごとの達成度(P.7-8)'!$Q26:S41)","v":0},{"$f":"SUM('印刷-目標ごとの達成度(P.7-8)'!$Q26:T41)","v":0},{"$f":"SUM('印刷-目標ごとの達成度(P.7-8)'!$Q26:U41)","v":0},{"$f":"SUM('印刷-目標ごとの達成度(P.7-8)'!$Q26:V41)","v":0},{"$f":"SUM('印刷-目標ごとの達成度(P.7-8)'!$Q26:W41)","v":0},{"$f":"SUM('印刷-目標ごとの達成度(P.7-8)'!$Q26:X41)","v":0},{"$f":"SUM('印刷-目標ごとの達成度(P.7-8)'!$Q26:Y41)","v":0},{"$f":"SUM('印刷-目標ごとの達成度(P.7-8)'!$Q26:Z41)","v":0},{"$f":"SUM('印刷-目標ごとの達成度(P.7-8)'!$Q26:AA41)","v":0},{"$f":"SUM('印刷-目標ごとの達成度(P.7-8)'!$AB26:AB41)","v":0},{"$f":"SUM('印刷-目標ごとの達成度(P.7-8)'!AC26:AC41)","v":0},{"$f":"SUM('印刷-目標ごとの達成度(P.7-8)'!AD26:AD41)","v":0},{"$f":"SUM('印刷-目標ごとの達成度(P.7-8)'!AE26:AE41)","v":0},{"$f":"SUM('印刷-目標ごとの達成度(P.7-8)'!AF26:AF41)","v":0},{"$f":"SUM('印刷-目標ごとの達成度(P.7-8)'!AG26:AG41)","v":0},{"$f":"SUM('印刷-目標ごとの達成度(P.7-8)'!AH26:AH41)","v":0},{"$f":"SUM('印刷-目標ごとの達成度(P.7-8)'!AI26:AI41)","v":0},{"$f":"SUM('印刷-目標ごとの達成度(P.7-8)'!AJ26:AJ41)","v":0},{"$f":"SUM('印刷-目標ごとの達成度(P.7-8)'!AK26:AK41)","v":0},{"$f":"SUM('印刷-目標ごとの達成度(P.7-8)'!AL26:AL41)","v":0},{"$f":"IF(E5=0,0,SUM($P5:P5)/E5)","v":0},{"$f":"IF(F5=0,0,SUM($P5:Q5)/F5)","v":0},{"$f":"IF(G5=0,0,SUM($P5:R5)/G5)","v":0},{"$f":"IF(H5=0,0,SUM($P5:S5)/H5)","v":0},{"$f":"IF(I5=0,0,SUM($P5:T5)/I5)","v":0},{"$f":"IF(J5=0,0,SUM($P5:U5)/J5)","v":0},{"$f":"IF(K5=0,0,SUM($P5:V5)/K5)","v":0},{"$f":"IF(L5=0,0,SUM($P5:W5)/L5)","v":0},{"$f":"IF(M5=0,0,SUM($P5:X5)/M5)","v":0},{"$f":"IF(N5=0,0,SUM($P5:Y5)/N5)","v":0},{"$f":"IF(O5=0,0,SUM($P5:Z5)/O5)","v":0}]
["(D) 専門基礎",{"$f":"SUM('印刷-目標ごとの達成度(P.7-8)'!O42:O51)","v":0},{"$f":"SUM('印刷-目標ごとの達成度(P.7-8)'!N42:N51)","v":0},{"$error":"#DIV/0!"},{"$f":"SUM('印刷-目標ごとの達成度(P.7-8)'!$Q42:Q51)","v":0},{"$f":"SUM('印刷-目標ごとの達成度(P.7-8)'!$Q42:R51)","v":0},{"$f":"SUM('印刷-目標ごとの達成度(P.7-8)'!$Q42:S51)","v":0},{"$f":"SUM('印刷-目標ごとの達成度(P.7-8)'!$Q42:T51)","v":0},{"$f":"SUM('印刷-目標ごとの達成度(P.7-8)'!$Q42:U51)","v":0},{"$f":"SUM('印刷-目標ごとの達成度(P.7-8)'!$Q42:V51)","v":0},{"$f":"SUM('印刷-目標ごとの達成度(P.7-8)'!$Q42:W51)","v":0},{"$f":"SUM('印刷-目標ごとの達成度(P.7-8)'!$Q42:X51)","v":0},{"$f":"SUM('印刷-目標ごとの達成度(P.7-8)'!$Q42:Y51)","v":0},{"$f":"SUM('印刷-目標ごとの達成度(P.7-8)'!$Q42:Z51)","v":0},{"$f":"SUM('印刷-目標ごとの達成度(P.7-8)'!$Q42:AA51)","v":0},{"$f":"SUM('印刷-目標ごとの達成度(P.7-8)'!$AB42:AB51)","v":0},{"$f":"SUM('印刷-目標ごとの達成度(P.7-8)'!AC42:AC51)","v":0},{"$f":"SUM('印刷-目標ごとの達成度(P.7-8)'!AD42:AD51)","v":0},{"$f":"SUM('印刷-目標ごとの達成度(P.7-8)'!AE42:AE51)","v":0},{"$f":"SUM('印刷-目標ごとの達成度(P.7-8)'!AF42:AF51)","v":0},{"$f":"SUM('印刷-目標ごとの達成度(P.7-8)'!AG42:AG51)","v":0},{"$f":"SUM('印刷-目標ごとの達成度(P.7-8)'!AH42:AH51)","v":0},{"$f":"SUM('印刷-目標ごとの達成度(P.7-8)'!AI42:AI51)","v":0},{"$f":"SUM('印刷-目標ごとの達成度(P.7-8)'!AJ42:AJ51)","v":0},{"$f":"SUM('印刷-目標ごとの達成度(P.7-8)'!AK42:AK51)","v":0},{"$f":"SUM('印刷-目標ごとの達成度(P.7-8)'!AL42:AL51)","v":0},{"$f":"IF(E6=0,0,SUM($P6:P6)/E6)","v":0},{"$f":"IF(F6=0,0,SUM($P6:Q6)/F6)","v":0},{"$f":"IF(G6=0,0,SUM($P6:R6)/G6)","v":0},{"$f":"IF(H6=0,0,SUM($P6:S6)/H6)","v":0},{"$f":"IF(I6=0,0,SUM($P6:T6)/I6)","v":0},{"$f":"IF(J6=0,0,SUM($P6:U6)/J6)","v":0},{"$f":"IF(K6=0,0,SUM($P6:V6)/K6)","v":0},{"$f":"IF(L6=0,0,SUM($P6:W6)/L6)","v":0},{"$f":"IF(M6=0,0,SUM($P6:X6)/M6)","v":0},{"$f":"IF(N6=0,0,SUM($P6:Y6)/N6)","v":0},{"$f":"IF(O6=0,0,SUM($P6:Z6)/O6)","v":0}]
{"$rows_left_out":15}